Reaction Details
TargetTropomyosin alpha-1 chain
LigandBDBM48719
Substrate/Competitorn/a
Meas. Tech.Fluorescence-based biochemical high throughput dose response assay for inhibitors of the calcium sensitivity of cardiac Regulated Thin Filaments (RTF)
IC50 7659±n/a nM
Citation PubChem, PC Fluorescence-based biochemical high throughput dose response assay for inhibitors of the calcium sensitivity of cardiac Regulated Thin Filaments (RTF) PubChem Bioassay(2011)[AID]
 
Tropomyosin alpha-1 chain
Name:Tropomyosin alpha-1 chain
Type:Enzyme Catalytic Domain
Mol. Mass.:32681.01
Organism:Sus scrofa
Description:P42639
Residue:284
BDBM48719
NameBDBM48719
Synonyms:4-[2-[(E)-[1-[2-(4-methylanilino)-2-oxoethyl]-2,5-dioxo-4-imidazolidinylidene]methyl]-1-pyrrolyl]benzoic acid 4-[2-[(E)-[1-[2-[(4-methylphenyl)amino]-2-oxidanylidene-ethyl]-2,5-bis(oxidanylidene)imidazolidin-4-ylidene]methyl]pyrrol-1-yl]benzoic acid 4-{2-[(E)-(1-{2-[(4-methylphenyl)amino]-2-oxoethyl}-2,5-dioxoimidazolidin-4-ylidene)methyl]-1H-pyrrol-1-yl}benzoic acid SMR000207594 | cid_12004437
TypeSmall organic molecule
Emp. Form.C24H20N4O5
Mol. Mass.444.4394
SMILESCc1ccc(NC(=O)CN2C(=O)N\C(=C\c3cccn3-c3ccc(cc3)C(O)=O)C2=O)cc1