Reaction Details
TargetTropomyosin alpha-1 chain
LigandBDBM50473
Substrate/Competitorn/a
Meas. Tech.Fluorescence-based biochemical high throughput dose response assay for inhibitors of the calcium sensitivity of cardiac Regulated Thin Filaments (RTF)
IC50 20888±n/a nM
Citation PubChem, PC Fluorescence-based biochemical high throughput dose response assay for inhibitors of the calcium sensitivity of cardiac Regulated Thin Filaments (RTF) PubChem Bioassay(2011)[AID]
 
Tropomyosin alpha-1 chain
Name:Tropomyosin alpha-1 chain
Type:Enzyme Catalytic Domain
Mol. Mass.:32681.01
Organism:Sus scrofa
Description:P42639
Residue:284
BDBM50473
NameBDBM50473
Synonyms:2,3-bis(2-furanyl)-6-quinoxalinecarboxylic acid 2,3-bis(furan-2-yl)quinoxaline-6-carboxylic acid SMR000273313 | cid_774142
TypeSmall organic molecule
Emp. Form.C17H10N2O4
Mol. Mass.306.2723
SMILESOC(=O)c1ccc2nc(-c3ccco3)c(nc2c1)-c1ccco1