Reaction Details
TargetTropomyosin alpha-1 chain
LigandBDBM55058
Substrate/Competitorn/a
Meas. Tech.Fluorescence-based biochemical high throughput dose response assay for inhibitors of the calcium sensitivity of cardiac Regulated Thin Filaments (RTF)
IC50 1640±n/a nM
Citation PubChem, PC Fluorescence-based biochemical high throughput dose response assay for inhibitors of the calcium sensitivity of cardiac Regulated Thin Filaments (RTF) PubChem Bioassay(2011)[AID]
 
Tropomyosin alpha-1 chain
Name:Tropomyosin alpha-1 chain
Type:Enzyme Catalytic Domain
Mol. Mass.:32681.01
Organism:Sus scrofa
Description:P42639
Residue:284
BDBM55058
NameBDBM55058
Synonyms:2,6,7-trihydroxy-9-(2-nitrophenyl)-3-xanthenone 2,6,7-trihydroxy-9-(2-nitrophenyl)fluorone 9-(2-nitrophenyl)-2,6,7-tris(oxidanyl)xanthen-3-one SMR000555396 | cid_3728472
TypeSmall organic molecule
Emp. Form.C19H11NO7
Mol. Mass.365.2931
SMILESOc1cc2oc3cc(=O)c(O)cc3c(-c3ccccc3[N+]([O-])=O)c2cc1O