Reaction Details
TargetTropomyosin alpha-1 chain
LigandBDBM34712
Substrate/Competitorn/a
Meas. Tech.Fluorescence-based biochemical high throughput dose response assay for inhibitors of the calcium sensitivity of cardiac Regulated Thin Filaments (RTF)
IC50>2647±n/a nM
Citation PubChem, PC Fluorescence-based biochemical high throughput dose response assay for inhibitors of the calcium sensitivity of cardiac Regulated Thin Filaments (RTF) PubChem Bioassay(2011)[AID]
 
Tropomyosin alpha-1 chain
Name:Tropomyosin alpha-1 chain
Type:Enzyme Catalytic Domain
Mol. Mass.:32681.01
Organism:Sus scrofa
Description:P42639
Residue:284
BDBM34712
NameBDBM34712
Synonyms:6,7-bis(oxidanyl)-4-[[5-(3,4,5-trimethoxyphenyl)-1,3,4-oxadiazol-2-yl]sulfanylmethyl]chromen-2-one 6,7-dihydroxy-4-[[[5-(3,4,5-trimethoxyphenyl)-1,3,4-oxadiazol-2-yl]thio]methyl]-1-benzopyran-2-one MLS000565663 cid_5689963
TypeSmall organic molecule
Emp. Form.C21H18N2O8S
Mol. Mass.458.441
SMILESCOc1cc(cc(OC)c1OC)-c1nnc(SCc2cc(=O)oc3cc(O)c(O)cc23)o1