Reaction Details
TargetTropomyosin alpha-1 chain
LigandBDBM80828
Substrate/Competitorn/a
Meas. Tech.Fluorescence-based biochemical high throughput dose response assay for inhibitors of the calcium sensitivity of cardiac Regulated Thin Filaments (RTF)
IC50>71457±n/a nM
Citation PubChem, PC Fluorescence-based biochemical high throughput dose response assay for inhibitors of the calcium sensitivity of cardiac Regulated Thin Filaments (RTF) PubChem Bioassay(2011)[AID]
 
Tropomyosin alpha-1 chain
Name:Tropomyosin alpha-1 chain
Type:Enzyme Catalytic Domain
Mol. Mass.:32681.01
Organism:Sus scrofa
Description:P42639
Residue:284
BDBM80828
NameBDBM80828
Synonyms:2,5-bis(2-furanylmethylidene)-1-cyclopentanone 2,5-bis(furan-2-ylmethylidene)cyclopentan-1-one SMR001548072 | cid_227197
TypeSmall organic molecule
Emp. Form.C15H12O3
Mol. Mass.240.254
SMILESO=C1C(CCC1=Cc1ccco1)=Cc1ccco1