Reaction Details
TargetCysteine protease ATG4B
LigandBDBM80846
Substrate/Competitorn/a
Meas. Tech.Dose response confirmation of the uHTS fluorescent assay for identification of inhibitors of ATG4B.
IC50 2360±n/a nM
Citation PubChem, PC Dose response confirmation of the uHTS fluorescent assay for identification of inhibitors of ATG4B. PubChem Bioassay(2011)[AID]
 
Cysteine protease ATG4B
Name:Cysteine protease ATG4B
Type:Enzyme Catalytic Domain
Mol. Mass.:44279.79
Organism:Homo sapiens (Human)
Description:gi_47132611
Residue:393
BDBM80846
NameBDBM80846
Synonyms:2-[[3-(cyclohexylmethyl)-4-keto-quinazolin-2-yl]thio]propionic acid ethyl ester MLS000537883 cid_2959700 ethyl 2-[3-(cyclohexylmethyl)-4-oxoquinazolin-2-yl]sulfanylpropanoate | ethyl 2-{[3-(cyclohexylmethyl)-4-oxo-3,4-dihydro-2-quinazolinyl]thio}propanoate
TypeSmall organic molecule
Emp. Form.C20H26N2O3S
Mol. Mass.374.497
SMILESCCOC(=O)C(C)Sc1nc2ccccc2c(=O)n1CC1CCCCC1