Reaction Details
TargetCysteine protease ATG4B
LigandBDBM49153
Substrate/Competitorn/a
Meas. Tech.Dose response confirmation of the uHTS fluorescent assay for identification of inhibitors of ATG4B.
IC50 5430±n/a nM
Citation PubChem, PC Dose response confirmation of the uHTS fluorescent assay for identification of inhibitors of ATG4B. PubChem Bioassay(2011)[AID]
 
Cysteine protease ATG4B
Name:Cysteine protease ATG4B
Type:Enzyme Catalytic Domain
Mol. Mass.:44279.79
Organism:Homo sapiens (Human)
Description:gi_47132611
Residue:393
BDBM49153
NameBDBM49153
Synonyms:MLS000530403 N-[1-(1,3-diketoindan-2-yl)ethylideneamino]-3-hydroxy-2-naphthamide N-[1-(1,3-dioxoinden-2-yl)ethylideneamino]-3-hydroxynaphthalene-2-carboxamide SMR000135380 | cid_1010001
TypeSmall organic molecule
Emp. Form.C22H16N2O4
Mol. Mass.372.3734
SMILES[#6]\[#6](-[#7]-[#7]-[#6](=O)-c1cc2ccccc2cc1-[#8])=[#6]-1\[#6](=O)-c2ccccc2-[#6]-1=O