Reaction Details
TargetCysteine protease ATG4B
LigandBDBM47570
Substrate/Competitorn/a
Meas. Tech.Dose response confirmation of the uHTS fluorescent assay for identification of inhibitors of ATG4B.
IC50 2530±n/a nM
Citation PubChem, PC Dose response confirmation of the uHTS fluorescent assay for identification of inhibitors of ATG4B. PubChem Bioassay(2011)[AID]
 
Cysteine protease ATG4B
Name:Cysteine protease ATG4B
Type:Enzyme Catalytic Domain
Mol. Mass.:44279.79
Organism:Homo sapiens (Human)
Description:gi_47132611
Residue:393
BDBM47570
NameBDBM47570
Synonyms:(1Z)-1-[[2-[4-(1H-imidazol-2-yl)phthalazin-1-yl]hydrazinyl]methylidene]naphthalen-2-one (1Z)-1-[[[4-(1H-imidazol-2-yl)-1-phthalazinyl]hydrazo]methylidene]-2-naphthalenone SMR000151639 | cid_11948738
TypeSmall organic molecule
Emp. Form.C22H16N6O
Mol. Mass.380.402
SMILESOc1ccc2ccccc2c1CN=Nc1nnc(-c2ncc[nH]2)c2ccccc12