Reaction Details
TargetCysteine protease ATG4B
LigandBDBM80868
Substrate/Competitorn/a
Meas. Tech.Dose response confirmation of the uHTS fluorescent assay for identification of inhibitors of ATG4B.
IC50 870±n/a nM
Citation PubChem, PC Dose response confirmation of the uHTS fluorescent assay for identification of inhibitors of ATG4B. PubChem Bioassay(2011)[AID]
 
Cysteine protease ATG4B
Name:Cysteine protease ATG4B
Type:Enzyme Catalytic Domain
Mol. Mass.:44279.79
Organism:Homo sapiens (Human)
Description:gi_47132611
Residue:393
BDBM80868
NameBDBM80868
Synonyms:MLS000582413 N-(3-chloro-2-pyrrolidin-1-ylphenyl)-3-(2-oxochromen-3-yl)benzamide N-[3-chloro-2-(1-pyrrolidinyl)phenyl]-3-(2-oxo-1-benzopyran-3-yl)benzamide SMR000200958 | cid_2301800
TypeSmall organic molecule
Emp. Form.C26H21ClN2O3
Mol. Mass.444.91
SMILESClc1cccc(NC(=O)c2cccc(c2)-c2cc3ccccc3oc2=O)c1N1CCCC1