Reaction Details
TargetCysteine protease ATG4B
LigandBDBM80880
Substrate/Competitorn/a
Meas. Tech.Dose response confirmation of the uHTS fluorescent assay for identification of inhibitors of ATG4B.
IC50 399±n/a nM
Citation PubChem, PC Dose response confirmation of the uHTS fluorescent assay for identification of inhibitors of ATG4B. PubChem Bioassay(2011)[AID]
 
Cysteine protease ATG4B
Name:Cysteine protease ATG4B
Type:Enzyme Catalytic Domain
Mol. Mass.:44279.79
Organism:Homo sapiens (Human)
Description:gi_47132611
Residue:393
BDBM80880
NameBDBM80880
Synonyms:7-Ethyl-5-(4-nitro-phenyl)-2-phenyl-3H-benzo[e][1,2,4]triazepine MLS000566936 cid_3135949
TypeSmall organic molecule
Emp. Form.C22H18N4O2
Mol. Mass.370.4039
SMILESCCc1ccc2N=C(N=[NH+][C-](c3ccc(cc3)[N+]([O-])=O)c2c1)c1ccccc1