Reaction Details
TargetCysteine protease ATG4B
LigandBDBM54372
Substrate/Competitorn/a
Meas. Tech.Dose response confirmation of the uHTS fluorescent assay for identification of inhibitors of ATG4B.
IC50 4240±n/a nM
Citation PubChem, PC Dose response confirmation of the uHTS fluorescent assay for identification of inhibitors of ATG4B. PubChem Bioassay(2011)[AID]
 
Cysteine protease ATG4B
Name:Cysteine protease ATG4B
Type:Enzyme Catalytic Domain
Mol. Mass.:44279.79
Organism:Homo sapiens (Human)
Description:gi_47132611
Residue:393
BDBM54372
NameBDBM54372
Synonyms:(5Z)-5-[(6-methoxy-2-piperidin-1-yl-quinolin-3-yl)methylidene]-2-sulfanylidene-1,3-thiazolidin-4-one (5Z)-5-[(6-methoxy-2-piperidino-3-quinolyl)methylene]-2-thioxo-thiazolidin-4-one 5-[1-(6-Methoxy-2-piperidin-1-yl-quinolin-3-yl)-meth-(Z)-ylidene]-2-thioxo-thiazolidin-4-one SMR000427674 | cid_1385343
TypeSmall organic molecule
Emp. Form.C19H19N3O2S2
Mol. Mass.385.503
SMILESCOc1ccc2nc(N3CCCCC3)c(C=C3SC(S)=NC3=O)cc2c1