Reaction Details
TargetCysteine protease ATG4B
LigandBDBM42035
Substrate/Competitorn/a
Meas. Tech.Dose response confirmation of the uHTS fluorescent assay for identification of inhibitors of ATG4B.
IC50 5280±n/a nM
Citation PubChem, PC Dose response confirmation of the uHTS fluorescent assay for identification of inhibitors of ATG4B. PubChem Bioassay(2011)[AID]
 
Cysteine protease ATG4B
Name:Cysteine protease ATG4B
Type:Enzyme Catalytic Domain
Mol. Mass.:44279.79
Organism:Homo sapiens (Human)
Description:gi_47132611
Residue:393
BDBM42035
NameBDBM42035
Synonyms:4-[(3aR,4S,9bS)-8-[(4-methoxyphenyl)sulfamoyl]-3a,4,5,9b-tetrahydro-3H-cyclopenta[c]quinolin-4-yl]benzoic acid cid_5322407
TypeSmall organic molecule
Emp. Form.C26H24N2O5S
Mol. Mass.476.544
SMILESCOc1ccc(NS(=O)(=O)c2ccc3N[C@@H]([C@@H]4CC=C[C@@H]4c3c2)c2ccc(cc2)C(O)=O)cc1