Reaction Details
TargetHexokinase-1
LigandBDBM80768
Substrate/Competitorn/a
Meas. Tech.Dose Response confirmation of activators of hexokinase domain containing I (HKDC1) in the hexokinase 1 selectivity assay
EC50 21700±n/a nM
Citation PubChem, PC Dose Response confirmation of activators of hexokinase domain containing I (HKDC1) in the hexokinase 1 selectivity assay PubChem Bioassay(2011)[AID]
 
Hexokinase-1
Name:Hexokinase-1
Type:PROTEIN
Mol. Mass.:102488.34
Organism:Homo sapiens (Human)
Description:EBI_11382
Residue:917
BDBM80768
NameBDBM80768
Synonyms:1-[2-(1-azepanyl)-2-oxoethyl]-8-methyl-4-[1]benzopyrano[4,3-c]pyrazolone 1-[2-(azepan-1-yl)-2-oxidanylidene-ethyl]-8-methyl-chromeno[4,3-c]pyrazol-4-one MLS000118337 cid_5309702
TypeSmall organic molecule
Emp. Form.C19H21N3O3
Mol. Mass.339.3883
SMILESCc1ccc2oc(=O)c3cnn(CC(=O)N4CCCCCC4)c3c2c1