Reaction Details
TargetHexokinase-1
LigandBDBM34648
Substrate/Competitorn/a
Meas. Tech.Dose Response confirmation of activators of hexokinase domain containing I (HKDC1) in the hexokinase 1 selectivity assay
EC50 39900±n/a nM
Citation PubChem, PC Dose Response confirmation of activators of hexokinase domain containing I (HKDC1) in the hexokinase 1 selectivity assay PubChem Bioassay(2011)[AID]
 
Hexokinase-1
Name:Hexokinase-1
Type:PROTEIN
Mol. Mass.:102488.34
Organism:Homo sapiens (Human)
Description:EBI_11382
Residue:917
BDBM34648
NameBDBM34648
Synonyms:(4-chlorodithiazol-5-ylidene)-(4,6-dimethyl-2-pyridyl)amine 4-chloro-N-(4,6-dimethyl-2-pyridinyl)-5-dithiazolimine MLS000104333 cid_757789
TypeSmall organic molecule
Emp. Form.C9H8ClN3S2
Mol. Mass.257.763
SMILESCc1cc(C)nc(c1)N=c1ssnc1Cl