Reaction Details
TargetHexokinase-1
LigandBDBM48647
Substrate/Competitorn/a
Meas. Tech.Dose Response confirmation of activators of hexokinase domain containing I (HKDC1) in the hexokinase 1 selectivity assay
EC50 37400±n/a nM
Citation PubChem, PC Dose Response confirmation of activators of hexokinase domain containing I (HKDC1) in the hexokinase 1 selectivity assay PubChem Bioassay(2011)[AID]
 
Hexokinase-1
Name:Hexokinase-1
Type:PROTEIN
Mol. Mass.:102488.34
Organism:Homo sapiens (Human)
Description:EBI_11382
Residue:917
BDBM48647
NameBDBM48647
Synonyms:2-[[2-[[1-(4-methoxyphenyl)-5-tetrazolyl]thio]-1-oxoethyl]amino]-4,5-dimethyl-3-thiophenecarboxylic acid ethyl ester MLS000538903 cid_2238453 ethyl 2-[2-[[1-(4-methoxyphenyl)-1,2,3,4-tetrazol-5-yl]sulfanyl]ethanoylamino]-4,5-dimethyl-thiophene-3-carboxylate | ethyl 2-[[2-[1-(4-methoxyphenyl)tetrazol-5-yl]sulfanylacetyl]amino]-4,5-dimethylthiophene-3-carboxylate
TypeSmall organic molecule
Emp. Form.C19H21N5O4S2
Mol. Mass.447.531
SMILESCCOC(=O)c1c(C)c(C)sc1NC(=O)CSc1nnnn1-c1ccc(OC)cc1