Reaction Details
TargetHexokinase-1
LigandBDBM80779
Substrate/Competitorn/a
Meas. Tech.Dose Response confirmation of activators of hexokinase domain containing I (HKDC1) in the hexokinase 1 selectivity assay
EC50 24700±n/a nM
Citation PubChem, PC Dose Response confirmation of activators of hexokinase domain containing I (HKDC1) in the hexokinase 1 selectivity assay PubChem Bioassay(2011)[AID]
 
Hexokinase-1
Name:Hexokinase-1
Type:PROTEIN
Mol. Mass.:102488.34
Organism:Homo sapiens (Human)
Description:EBI_11382
Residue:917
BDBM80779
NameBDBM80779
Synonyms:MLS000547762 N-[2-[(4-methyl-1,2,4-triazol-3-yl)sulfanyl]-1,2-dihydroacenaphthylen-1-yl]benzenesulfonamide N-[2-[(4-methyl-1,2,4-triazol-3-yl)thio]acenaphthen-1-yl]benzenesulfonamide cid_2913537
TypeSmall organic molecule
Emp. Form.C21H18N4O2S2
Mol. Mass.422.523
SMILESCn1cnnc1SC1C(NS(=O)(=O)c2ccccc2)c2cccc3cccc1c23