Reaction Details
TargetHexokinase-1
LigandBDBM64655
Substrate/Competitorn/a
Meas. Tech.Dose Response confirmation of activators of hexokinase domain containing I (HKDC1) in the hexokinase 1 selectivity assay
EC50>80000±n/a nM
Citation PubChem, PC Dose Response confirmation of activators of hexokinase domain containing I (HKDC1) in the hexokinase 1 selectivity assay PubChem Bioassay(2011)[AID]
 
Hexokinase-1
Name:Hexokinase-1
Type:PROTEIN
Mol. Mass.:102488.34
Organism:Homo sapiens (Human)
Description:EBI_11382
Residue:917
BDBM64655
NameBDBM64655
Synonyms:1-(3,4-dichlorophenyl)-3-(pyridin-2-ylcarbonylamino)thiourea 1-(3,4-dichlorophenyl)-3-[[oxo(2-pyridinyl)methyl]amino]thiourea MLS000662162 SMR000294066 | cid_969982
TypeSmall organic molecule
Emp. Form.C13H10Cl2N4OS
Mol. Mass.341.216
SMILESClc1ccc(NC(=S)NNC(=O)c2ccccn2)cc1Cl