Reaction Details
TargetHexokinase-1
LigandBDBM52665
Substrate/Competitorn/a
Meas. Tech.Dose Response confirmation of activators of hexokinase domain containing I (HKDC1) in the hexokinase 1 selectivity assay
EC50 20800±n/a nM
Citation PubChem, PC Dose Response confirmation of activators of hexokinase domain containing I (HKDC1) in the hexokinase 1 selectivity assay PubChem Bioassay(2011)[AID]
 
Hexokinase-1
Name:Hexokinase-1
Type:PROTEIN
Mol. Mass.:102488.34
Organism:Homo sapiens (Human)
Description:EBI_11382
Residue:917
BDBM52665
NameBDBM52665
Synonyms:1-(5-acetyl-3-methyl-6-phenyl-5H-[1,2,4]triazolo[3,4-b][1,3,4]thiadiazin-7-yl)ethanone 1-(5-ethanoyl-3-methyl-6-phenyl-[1,2,4]triazolo[3,4-b][1,3,4]thiadiazin-7-yl)ethanone SMR000312275 | cid_5295671
TypeSmall organic molecule
Emp. Form.C15H14N4O2S
Mol. Mass.314.362
SMILESCC(=O)N1C(=C(Sc2nnc(C)n12)C(C)=O)c1ccccc1