Reaction Details
TargetHexokinase-1
LigandBDBM66618
Substrate/Competitorn/a
Meas. Tech.Dose Response confirmation of activators of hexokinase domain containing I (HKDC1) in the hexokinase 1 selectivity assay
EC50 29400±n/a nM
Citation PubChem, PC Dose Response confirmation of activators of hexokinase domain containing I (HKDC1) in the hexokinase 1 selectivity assay PubChem Bioassay(2011)[AID]
 
Hexokinase-1
Name:Hexokinase-1
Type:PROTEIN
Mol. Mass.:102488.34
Organism:Homo sapiens (Human)
Description:EBI_11382
Residue:917
BDBM66618
NameBDBM66618
Synonyms:MLS000830340 N-[2-(4-acetylpiperazin-1-yl)-1,2-dihydroacenaphthylen-1-yl]benzenesulfonamide N-[2-(4-ethanoylpiperazin-1-yl)-1,2-dihydroacenaphthylen-1-yl]benzenesulfonamide cid_660189
TypeSmall organic molecule
Emp. Form.C24H25N3O3S
Mol. Mass.435.539
SMILESCC(=O)N1CCN(CC1)C1C(NS(=O)(=O)c2ccccc2)c2cccc3cccc1c23