Reaction Details
TargetHexokinase-1
LigandBDBM34233
Substrate/Competitorn/a
Meas. Tech.Dose Response confirmation of activators of hexokinase domain containing I (HKDC1) in the hexokinase 1 selectivity assay
EC50 41900±n/a nM
Citation PubChem, PC Dose Response confirmation of activators of hexokinase domain containing I (HKDC1) in the hexokinase 1 selectivity assay PubChem Bioassay(2011)[AID]
 
Hexokinase-1
Name:Hexokinase-1
Type:PROTEIN
Mol. Mass.:102488.34
Organism:Homo sapiens (Human)
Description:EBI_11382
Residue:917
BDBM34233
NameBDBM34233
Synonyms:2-Phenyl-benzo[d]isoselenazol-3-one 2-phenyl-1,2-benzisoselazol-3(2H)-one 2-phenylbenzo[d][1,2]selenazol-3(2H)-one EBSELEN MLS000028488 cid_3194 | med.21724, Compound 153
TypeSmall organic molecule
Emp. Form.C13H9NOSe
Mol. Mass.274.18
SMILESO=c1n([se]c2ccccc12)-c1ccccc1