Reaction Details
TargetHexokinase HKDC1 [W721R]
LigandBDBM43363
Substrate/Competitorn/a
Meas. Tech.Dose Response confirmation of inhibitors of hexokinase domain containing I (HKDC1) in the hexokinase 1 selectivity assay
IC50 71600±n/a nM
Citation PubChem, PC Dose Response confirmation of inhibitors of hexokinase domain containing I (HKDC1) in the hexokinase 1 selectivity assay PubChem Bioassay(2011)[AID]
 
Hexokinase HKDC1 [W721R]
Name:Hexokinase HKDC1 [W721R]
Type:Enzyme Catalytic Domain
Mol. Mass.:102520.24
Organism:Homo sapiens (Human)
Description:gi_156151420
Residue:917
BDBM43363
NameBDBM43363
Synonyms:2,5-bis(chloranyl)-3-piperidin-1-yl-6-(2-piperidin-1-yl-1,3-thiazol-5-yl)cyclohexa-2,5-diene-1,4-dione 2,5-dichloro-3-(1-piperidinyl)-6-[2-(1-piperidinyl)-5-thiazolyl]cyclohexa-2,5-diene-1,4-dione 2,5-dichloro-3-piperidino-6-(2-piperidinothiazol-5-yl)-p-benzoquinone SMR000115104 | cid_406171
TypeSmall organic molecule
Emp. Form.C19H21Cl2N3O2S
Mol. Mass.426.36
SMILESClC1=C(N2CCCCC2)C(=O)C(Cl)=C(c2cnc(s2)N2CCCCC2)C1=O