Reaction Details
TargetGlucose-6-phosphate 1-dehydrogenase
LigandBDBM34435
Substrate/Competitorn/a
Meas. Tech.Human Glucose-6-Phosphate Dehydrogenase Dose Response Selectivity Assay for Inhibitors of Plasmodium falciparum Glucose-6-Phosphate Dehydrogenase
IC50>80000±n/a nM
Citation PubChem, PC Human Glucose-6-Phosphate Dehydrogenase Dose Response Selectivity Assay for Inhibitors of Plasmodium falciparum Glucose-6-Phosphate Dehydrogenase PubChem Bioassay(2011)[AID]
 
Glucose-6-phosphate 1-dehydrogenase
Name:Glucose-6-phosphate 1-dehydrogenase
Type:Enzyme
Mol. Mass.:59258.58
Organism:Homo sapiens (Human)
Description:P11413
Residue:515
BDBM34435
NameBDBM34435
Synonyms:4-cyano-3-methyl-5-[[1-oxo-2-[[5-(phenylmethyl)-1,3,4-oxadiazol-2-yl]thio]ethyl]amino]-2-thiophenecarboxylic acid ethyl ester MLS000051364 cid_2222655 ethyl 5-({[(5-benzyl-1,3,4-oxadiazol-2-yl)thio]acetyl}amino)-4-cyano-3-methyl-2-thiophenecarboxylate | ethyl 5-[[2-[(5-benzyl-1,3,4-oxadiazol-2-yl)sulfanyl]acetyl]amino]-4-cyano-3-methylthiophene-2-carboxylate
TypeSmall organic molecule
Emp. Form.C20H18N4O4S2
Mol. Mass.442.511
SMILESCCOC(=O)c1sc(NC(=O)CSc2nnc(Cc3ccccc3)o2)c(C#N)c1C