Reaction Details
TargetGlucose-6-phosphate 1-dehydrogenase
LigandBDBM81065
Substrate/Competitorn/a
Meas. Tech.Human Glucose-6-Phosphate Dehydrogenase Dose Response Selectivity Assay for Inhibitors of Plasmodium falciparum Glucose-6-Phosphate Dehydrogenase
IC50 31600±n/a nM
Citation PubChem, PC Human Glucose-6-Phosphate Dehydrogenase Dose Response Selectivity Assay for Inhibitors of Plasmodium falciparum Glucose-6-Phosphate Dehydrogenase PubChem Bioassay(2011)[AID]
 
Glucose-6-phosphate 1-dehydrogenase
Name:Glucose-6-phosphate 1-dehydrogenase
Type:Enzyme
Mol. Mass.:59258.58
Organism:Homo sapiens (Human)
Description:P11413
Residue:515
BDBM81065
NameBDBM81065
Synonyms:4-(2-benzylidenehydrazino)-N-(2-chlorophenyl)-4-oxobutanamide N'-(benzalamino)-N-(2-chlorophenyl)succinamide N-(2-chlorophenyl)-N'-[(phenylmethylene)amino]butanediamide SMR000228669 | cid_1789028
TypeSmall organic molecule
Emp. Form.C17H16ClN3O2
Mol. Mass.329.781
SMILESClc1ccccc1NC(=O)CCC(=O)NN=Cc1ccccc1