Reaction Details
TargetGlucose-6-phosphate 1-dehydrogenase
LigandBDBM54743
Substrate/Competitorn/a
Meas. Tech.Human Glucose-6-Phosphate Dehydrogenase Dose Response Selectivity Assay for Inhibitors of Plasmodium falciparum Glucose-6-Phosphate Dehydrogenase
IC50>80000±n/a nM
Citation PubChem, PC Human Glucose-6-Phosphate Dehydrogenase Dose Response Selectivity Assay for Inhibitors of Plasmodium falciparum Glucose-6-Phosphate Dehydrogenase PubChem Bioassay(2011)[AID]
 
Glucose-6-phosphate 1-dehydrogenase
Name:Glucose-6-phosphate 1-dehydrogenase
Type:Enzyme
Mol. Mass.:59258.58
Organism:Homo sapiens (Human)
Description:P11413
Residue:515
BDBM54743
NameBDBM54743
Synonyms:1-(4-piperidin-1-ylphenyl)pyrrole-2,5-dione 1-[4-(1-piperidinyl)phenyl]pyrrole-2,5-dione SMR000289810 | cid_512832
TypeSmall organic molecule
Emp. Form.C15H16N2O2
Mol. Mass.256.2997
SMILESO=C1C=CC(=O)N1c1ccc(cc1)N1CCCCC1