Reaction Details
TargetGlucose-6-phosphate 1-dehydrogenase
LigandBDBM46581
Substrate/Competitorn/a
Meas. Tech.Human Glucose-6-Phosphate Dehydrogenase Dose Response Selectivity Assay for Inhibitors of Plasmodium falciparum Glucose-6-Phosphate Dehydrogenase
IC50 12200±n/a nM
Citation PubChem, PC Human Glucose-6-Phosphate Dehydrogenase Dose Response Selectivity Assay for Inhibitors of Plasmodium falciparum Glucose-6-Phosphate Dehydrogenase PubChem Bioassay(2011)[AID]
 
Glucose-6-phosphate 1-dehydrogenase
Name:Glucose-6-phosphate 1-dehydrogenase
Type:Enzyme
Mol. Mass.:59258.58
Organism:Homo sapiens (Human)
Description:P11413
Residue:515
BDBM46581
NameBDBM46581
Synonyms:2-[1-hydroxy-4-[(3-nitrophenyl)sulfonylamino]naphthalen-2-yl]sulfanylacetic acid 2-[[1-hydroxy-4-[(3-nitrophenyl)sulfonylamino]-2-naphthalenyl]thio]acetic acid MLS000775741 cid_2939678
TypeSmall organic molecule
Emp. Form.C18H14N2O7S2
Mol. Mass.434.443
SMILESOC(=O)CSc1cc(NS(=O)(=O)c2cccc(c2)[N+]([O-])=O)c2ccccc2c1O