Reaction Details
TargetcAMP-dependent protein kinase type II-beta regulatory subunit
LigandBDBM81289
Substrate/Competitorn/a
Meas. Tech.Fluorescence polarization-based biochemical high throughput dose response assay for activators of the Protein Kinase A-R2B (PKA-R2B) complex
EC50 88.46±n/a nM
Citation PubChem, PC Fluorescence polarization-based biochemical high throughput dose response assay for activators of the Protein Kinase A-R2B (PKA-R2B) complex PubChem Bioassay(2011)[AID]
 
cAMP-dependent protein kinase type II-beta regulatory subunit
Name:cAMP-dependent protein kinase type II-beta regulatory subunit
Type:PROTEIN
Mol. Mass.:46282.41
Organism:Homo sapiens (Human)
Description:EBI_11972
Residue:418
BDBM81289
NameBDBM81289
Synonyms:Adenosine 3',5'-cyclic monophosphate sodium salt monohydrate SMR000875274 sodium;(4aR,6R,7R,7aS)-6-(6-aminopurin-9-yl)-2-oxidanidyl-2-oxidanylidene-4a,6,7,7a-tetrahydro-4H-furo[3,2-d][1,3,2]dioxaphosphinin-7-ol sodium;(4aR,6R,7R,7aS)-6-(6-aminopurin-9-yl)-2-oxido-2-oxo-4a,6,7,7a-tetrahydro-4H-furo[3,2-d][1,3,2]dioxaphosphorin-7-ol | sodium;(4aR,6R,7R,7aS)-6-adenin-9-yl-2-keto-2-oxido-4a,6,7,7a-tetrahydro-4H-furo[3,2-d][1,3,2]dioxaphosphorin-7-ol
TypeSmall organic molecule
Emp. Form.C10H11N5O6P
Mol. Mass.328.1986
SMILESNc1ncnc2n(cnc12)[C@@H]1O[C@@H]2COP([O-])(=O)O[C@H]2[C@H]1O