Reaction Details
TargetcAMP-dependent protein kinase type I-alpha regulatory subunit
LigandBDBM81290
Substrate/Competitorn/a
Meas. Tech.Counterscreen for activators of the Protein Kinase A-R2B (PKA-R2B) complex
EC50 4477±n/a nM
Citation PubChem, PC Counterscreen for activators of the Protein Kinase A-R2B (PKA-R2B) complex: fluorescence polarization-based biochemical high throughput dose response assay to identify activators of the Protein Kinase A-R1A (PKA-R1A) complex PubChem Bioassay(2011)[AID]
 
cAMP-dependent protein kinase type I-alpha regulatory subunit
Name:cAMP-dependent protein kinase type I-alpha regulatory subunit
Type:Enzyme Catalytic Domain
Mol. Mass.:42885.14
Organism:Bos taurus
Description:gi_115496662
Residue:380
BDBM81290
NameBDBM81290
Synonyms:MLS001148197 SMR000058940 sodium;[(4aR,6R,7R,7aR)-6-[6-(butanoylamino)purin-9-yl]-2-oxidanidyl-2-oxidanylidene-4a,6,7,7a-tetrahydro-4H-furo[3,2-d][1,3,2]dioxaphosphinin-7-yl] butanoate sodium;butanoic acid [(4aR,6R,7R,7aR)-2-oxido-2-oxo-6-[6-(1-oxobutylamino)-9-purinyl]-4a,6,7,7a-tetrahydro-4H-furo[3,2-d][1,3,2]dioxaphosphorin-7-yl] ester sodium;butyric acid [(4aR,6R,7R,7aR)-6-(6-butyramidopurin-9-yl)-2-keto-2-oxido-4a,6,7,7a-tetrahydro-4H-furo[3,2-d][1,3,2]dioxaphosphorin-7-yl] ester;hydrate
TypeSmall organic molecule
Emp. Form.C18H23N5O8P
Mol. Mass.468.3782
SMILESCCCC(=O)Nc1ncnc2n(cnc12)[C@@H]1O[C@@H]2COP([O-])(=O)O[C@H]2[C@H]1OC(=O)CCC