Reaction Details
TargetProto-oncogene tyrosine-protein kinase Src
LigandBDBM81374
Substrate/Competitorn/a
Meas. Tech.In Vitro Activity Assay
pH7.5±0
Kd 11±1 nM
Citation Ranjitkar, PBrock, AMMaly, DJ Affinity reagents that target a specific inactive form of protein kinases. Chem Biol17:195-206 (2010) 
 
Proto-oncogene tyrosine-protein kinase Src
Name:Proto-oncogene tyrosine-protein kinase Src
Type:Tyr protein kinase
Mol. Mass.:60015.36
Organism:Gallus gallus (Chicken)
Description:P00523
Residue:533
BDBM81374
NameBDBM81374
Synonyms:BODIPY-labeled probe, 4a
TypeSmall organic molecule
Emp. Form.C50H49BF4N11O4
Mol. Mass.954.799
SMILESCc1cc(C)n2B(F)[N+]3=C(CCC(=O)NCCCCC(=O)NCCOc4ccc(Nc5ncnc(n5)-c5cccnc5Nc5cc(NC(=O)c6cccc(c6)C(F)(F)F)ccc5C)cc4)C=CC3=Cc12