Reaction Details
TargetMitogen-activated protein kinase kinase kinase 5
LigandBDBM81375
Substrate/Competitorn/a
Meas. Tech.In Vitro Activity Assay
pH7.5±0
IC50>10000±0 nM
Citation Ranjitkar, PBrock, AMMaly, DJ Affinity reagents that target a specific inactive form of protein kinases. Chem Biol17:195-206 (2010) 
 
Mitogen-activated protein kinase kinase kinase 5
Name:Mitogen-activated protein kinase kinase kinase 5
Type:Protein
Mol. Mass.:154514.93
Organism:Homo sapiens (Human)
Description:Q99683
Residue:1374
BDBM81375
NameBDBM81375
Synonyms:Amine compound, 12a
TypeSmall organic molecule
Emp. Form.C41H46F3N9O7
Mol. Mass.833.8552
SMILESCc1ccc(NC(=O)c2cccc(c2)C(F)(F)F)cc1Nc1ncccc1-c1ncnc(Nc2ccc(OCCNC(=O)COCCOCCOCCOCCN)cc2)n1