Reaction Details
TargetSerine/threonine-protein kinase PAK 4
LigandBDBM81376
Substrate/Competitorn/a
Meas. Tech.In Vitro Activity Assay
pH7.5±0
IC50>10000±0 nM
Citation Ranjitkar, PBrock, AMMaly, DJ Affinity reagents that target a specific inactive form of protein kinases. Chem Biol17:195-206 (2010) 
 
Serine/threonine-protein kinase PAK 4
Name:Serine/threonine-protein kinase PAK 4
Type:Protein
Mol. Mass.:64098.01
Organism:Homo sapiens (Human)
Description:O96013
Residue:591
BDBM81376
NameBDBM81376
Synonyms:Amine compound, 13a
TypeSmall organic molecule
Emp. Form.C42H47F3N8O7
Mol. Mass.832.8672
SMILESCc1ccc(NC(=O)c2cccc(c2)C(F)(F)F)cc1Nc1ncccc1-c1cc(Nc2ccc(OCCNC(=O)COCCOCCOCCOCCN)cc2)ncn1