Reaction Details
TargetMitogen-activated protein kinase 7
LigandBDBM81377
Substrate/Competitorn/a
Meas. Tech.In Vitro Activity Kinase Assay
Kd 160±0.0 nM
Citation Zhou, WHur, WMcDermott, UDutt, AXian, WFicarro, SBZhang, JSharma, SVBrugge, JMeyerson, MSettleman, JGray, NS A structure-guided approach to creating covalent FGFR inhibitors. Chem Biol17:285-95 (2010) 
 
Mitogen-activated protein kinase 7
Name:Mitogen-activated protein kinase 7
Type:Protein
Mol. Mass.:88377.36
Organism:Homo sapiens (Human)
Description:Q13164
Residue:816
BDBM81377
NameBDBM81377
Synonyms:FIIN-1
TypeSmall organic molecule
Emp. Form.C30H35Cl2N7O4
Mol. Mass.628.549
SMILESCCNCCCCNc1ncc2CN(C(=O)N(Cc3cccc(NC(=O)C=C)c3)c2n1)c1c(Cl)c(OC)cc(OC)c1Cl