Reaction Details
TargetInosine-5'-monophosphate dehydrogenase
LigandBDBM81423
Substrate/Competitorn/a
Meas. Tech.Inhibition Assay
pH8±0
Temperature298.15±0 K
IC50 7.0e+4±n/a nM
Citation Gollapalli, DRMacpherson, ISLiechti, GGorla, SKGoldberg, JBHedstrom, L Structural determinants of inhibitor selectivity in prokaryotic IMP dehydrogenases. Chem Biol17:1084-91 (2010) 
 
Inosine-5'-monophosphate dehydrogenase
Name:Inosine-5'-monophosphate dehydrogenase
Type:Protein
Mol. Mass.:52801.05
Organism:Streptococcus pyogenes
Description:P0C0H6
Residue:493
BDBM81423
NameBDBM81423
Synonyms:N-(4-methoxyphenyl)-2-[2-(1,3-thiazol-4-yl)-1H-1,3-benzodiazol-1-yl]acetamide, Compound C
TypeSmall organic molecule
Emp. Form.C19H16N4O2S
Mol. Mass.364.421
SMILESCOc1ccc(NC(=O)Cn2c(nc3ccccc23)-c2cscn2)cc1