Reaction Details
TargetInosine-5'-monophosphate dehydrogenase
LigandBDBM81328
Substrate/Competitorn/a
Meas. Tech.Inhibition Assay
pH8±0
Temperature298.15±0 K
IC50 1.5e+4±n/a nM
Citation Gollapalli, DRMacpherson, ISLiechti, GGorla, SKGoldberg, JBHedstrom, L Structural determinants of inhibitor selectivity in prokaryotic IMP dehydrogenases. Chem Biol17:1084-91 (2010) 
 
Inosine-5'-monophosphate dehydrogenase
Name:Inosine-5'-monophosphate dehydrogenase
Type:Protein
Mol. Mass.:52801.05
Organism:Streptococcus pyogenes
Description:P0C0H6
Residue:493
BDBM81328
NameBDBM81328
Synonyms:methyl 3-methyl-2-oxo-1,2-dihydroquinoline-4-carboxylate, Compound E | methyl 3-methyl-2-oxo-1,2-dihydroquinoline-4-carboxylate, E
TypeSmall organic molecule
Emp. Form.C12H11NO3
Mol. Mass.217.2206
SMILESCOC(=O)c1c(C)c(=O)[nH]c2ccccc12