Reaction Details
TargetCyclin-dependent kinase 1
LigandBDBM81439
Substrate/Competitorn/a
Meas. Tech.In Vitro Kinase Assay
Ki 399±16 nM
Citation Wang, SGriffiths, GMidgley, CABarnett, ALCooper, MGrabarek, JIngram, LJackson, WKontopidis, GMcClue, SJMcInnes, CMcLachlan, JMeades, CMezna, MStuart, IThomas, MPZheleva, DILane, DPJackson, RCGlover, DMBlake, DGFischer, PM Discovery and characterization of 2-anilino-4- (thiazol-5-yl)pyrimidine transcriptional CDK inhibitors as anticancer agents. Chem Biol17:1111-21 (2010) 
 
Cyclin-dependent kinase 1
Name:Cyclin-dependent kinase 1
Type:Enzyme Subunit
Mol. Mass.:34101.08
Organism:Homo sapiens (Human)
Description:P06493
Residue:297
BDBM81439
NameBDBM81439
Synonyms:CDK Inhibitor, 12
TypeSmall organic molecule
Emp. Form.C16H13N5OS
Mol. Mass.323.372
SMILESCc1c(sc(=O)n1C)-c1ccnc(Nc2cccc(c2)C#N)n1