Reaction Details
TargetCyclin-dependent kinase 1
LigandBDBM81440
Substrate/Competitorn/a
Meas. Tech.In Vitro Kinase Assay
Ki 3.0±0.5 nM
Citation Wang, SGriffiths, GMidgley, CABarnett, ALCooper, MGrabarek, JIngram, LJackson, WKontopidis, GMcClue, SJMcInnes, CMcLachlan, JMeades, CMezna, MStuart, IThomas, MPZheleva, DILane, DPJackson, RCGlover, DMBlake, DGFischer, PM Discovery and characterization of 2-anilino-4- (thiazol-5-yl)pyrimidine transcriptional CDK inhibitors as anticancer agents. Chem Biol17:1111-21 (2010) 
 
Cyclin-dependent kinase 1
Name:Cyclin-dependent kinase 1
Type:Enzyme Subunit
Mol. Mass.:34101.08
Organism:Homo sapiens (Human)
Description:P06493
Residue:297
BDBM81440
NameBDBM81440
Synonyms:CDK Inhibitor, 13
TypeSmall organic molecule
Emp. Form.C16H15N5O3S
Mol. Mass.357.387
SMILESCc1c(sc(=O)n1C)-c1ccnc(Nc2ccc(C)c(c2)N(=O)=O)n1