Reaction Details
TargetCyclin-dependent kinase 2
LigandBDBM8061
Substrate/Competitorn/a
Meas. Tech.In Vitro Kinase Assay
Ki<1±0 nM
Citation Wang, SGriffiths, GMidgley, CABarnett, ALCooper, MGrabarek, JIngram, LJackson, WKontopidis, GMcClue, SJMcInnes, CMcLachlan, JMeades, CMezna, MStuart, IThomas, MPZheleva, DILane, DPJackson, RCGlover, DMBlake, DGFischer, PM Discovery and characterization of 2-anilino-4- (thiazol-5-yl)pyrimidine transcriptional CDK inhibitors as anticancer agents. Chem Biol17:1111-21 (2010) 
 
Cyclin-dependent kinase 2
Name:Cyclin-dependent kinase 2
Type:Enzyme Subunit
Mol. Mass.:33938.17
Organism:Homo sapiens (Human)
Description:P24941
Residue:298
BDBM8061
NameBDBM8061
Synonyms:2-Anilino-4-(thiazol-5-yl)pyrimidine deriv. 32 4-methyl-5-{2-[(3-nitrophenyl)amino]pyrimidin-4-yl}-1,3-thiazol-2-amine [4-(2-Amino-4-methylthiazol-5-yl)pyrimidin-2-yl](3-nitrophenyl)amine
TypeSmall organic molecule
Emp. Form.C14H12N6O2S
Mol. Mass.328.349
SMILESCc1nc(N)sc1-c1ccnc(Nc2cccc(c2)N(=O)=O)n1