Reaction Details
TargetCyclin-dependent kinase 2
LigandBDBM81430
Substrate/Competitorn/a
Meas. Tech.In Vitro Kinase Assay
Ki 2.4±1.3 nM
Citation Wang, SGriffiths, GMidgley, CABarnett, ALCooper, MGrabarek, JIngram, LJackson, WKontopidis, GMcClue, SJMcInnes, CMcLachlan, JMeades, CMezna, MStuart, IThomas, MPZheleva, DILane, DPJackson, RCGlover, DMBlake, DGFischer, PM Discovery and characterization of 2-anilino-4- (thiazol-5-yl)pyrimidine transcriptional CDK inhibitors as anticancer agents. Chem Biol17:1111-21 (2010) 
 
Cyclin-dependent kinase 2
Name:Cyclin-dependent kinase 2
Type:Enzyme Subunit
Mol. Mass.:33938.17
Organism:Homo sapiens (Human)
Description:P24941
Residue:298
BDBM81430
NameBDBM81430
Synonyms:CDK Inhibitor, 3
TypeSmall organic molecule
Emp. Form.C15H16N6O2S2
Mol. Mass.376.457
SMILESCNc1nc(C)c(s1)-c1ccnc(Nc2cccc(c2)S(N)(=O)=O)n1