Reaction Details
TargetCyclin-dependent kinase 2
LigandBDBM81436
Substrate/Competitorn/a
Meas. Tech.In Vitro Kinase Assay
Ki>500±0 nM
Citation Wang, SGriffiths, GMidgley, CABarnett, ALCooper, MGrabarek, JIngram, LJackson, WKontopidis, GMcClue, SJMcInnes, CMcLachlan, JMeades, CMezna, MStuart, IThomas, MPZheleva, DILane, DPJackson, RCGlover, DMBlake, DGFischer, PM Discovery and characterization of 2-anilino-4- (thiazol-5-yl)pyrimidine transcriptional CDK inhibitors as anticancer agents. Chem Biol17:1111-21 (2010) 
 
Cyclin-dependent kinase 2
Name:Cyclin-dependent kinase 2
Type:Enzyme Subunit
Mol. Mass.:33938.17
Organism:Homo sapiens (Human)
Description:P24941
Residue:298
BDBM81436
NameBDBM81436
Synonyms:CDK Inhibitor, 9
TypeSmall organic molecule
Emp. Form.C20H24N6O3S2
Mol. Mass.460.573
SMILESCNc1nc(C)c(s1)-c1ccnc(Nc2ccc(C)c(c2)S(=O)(=O)N2CCOCC2)n1