Reaction Details
TargetCyclin-dependent kinase 4
LigandBDBM81437
Substrate/Competitorn/a
Meas. Tech.In Vitro Kinase Assay
Ki>500±0 nM
Citation Wang, SGriffiths, GMidgley, CABarnett, ALCooper, MGrabarek, JIngram, LJackson, WKontopidis, GMcClue, SJMcInnes, CMcLachlan, JMeades, CMezna, MStuart, IThomas, MPZheleva, DILane, DPJackson, RCGlover, DMBlake, DGFischer, PM Discovery and characterization of 2-anilino-4- (thiazol-5-yl)pyrimidine transcriptional CDK inhibitors as anticancer agents. Chem Biol17:1111-21 (2010) 
 
Cyclin-dependent kinase 4
Name:Cyclin-dependent kinase 4
Type:Enzyme Subunit
Mol. Mass.:33731.96
Organism:Homo sapiens (Human)
Description:P11802
Residue:303
BDBM81437
NameBDBM81437
Synonyms:CDK Inhibitor, 10
TypeSmall organic molecule
Emp. Form.C19H22N6O3S2
Mol. Mass.446.546
SMILESCc1nc(N)sc1-c1ccnc(Nc2ccc(C)c(c2)S(=O)(=O)N2CCOCC2)n1