Reaction Details
TargetCyclin-dependent kinase 7
LigandBDBM81435
Substrate/Competitorn/a
Meas. Tech.In Vitro Kinase Assay
Ki 193±13 nM
Citation Wang, SGriffiths, GMidgley, CABarnett, ALCooper, MGrabarek, JIngram, LJackson, WKontopidis, GMcClue, SJMcInnes, CMcLachlan, JMeades, CMezna, MStuart, IThomas, MPZheleva, DILane, DPJackson, RCGlover, DMBlake, DGFischer, PM Discovery and characterization of 2-anilino-4- (thiazol-5-yl)pyrimidine transcriptional CDK inhibitors as anticancer agents. Chem Biol17:1111-21 (2010) 
 
Cyclin-dependent kinase 7
Name:Cyclin-dependent kinase 7
Type:Enzyme Subunit
Mol. Mass.:39047.01
Organism:Homo sapiens (Human)
Description:n/a
Residue:346
BDBM81435
NameBDBM81435
Synonyms:CDK Inhibitor, 8
TypeSmall organic molecule
Emp. Form.C16H18N6O2S2
Mol. Mass.390.483
SMILESCCNS(=O)(=O)c1cccc(Nc2nccc(n2)-c2sc(N)nc2C)c1