Reaction Details
TargetBeta-2 adrenergic receptor
LigandBDBM84342
Substrate/Competitorn/a
Ki>10000±n/a nM
CommentsPDSP_792
Citation Bylund, DBSnyder, SH Beta adrenergic receptor binding in membrane preparations from mammalian brain. Mol Pharmacol12:568-80 (1976) Beta-2 adrenergic receptor
Name:Beta-2 adrenergic receptor
Type:n/a
Mol. Mass.:46461.69
Organism:Homo sapiens (Human)
Description:P07550
Residue:413
BDBM84342
NameBDBM84342
Synonyms:4-[1-hydroxy-2-(methylamino)ethyl]benzene-1,2-diol 4-[1-hydroxy-2-(methylamino)ethyl]benzene-1,2-diol;hydrochloride 4-[2-(methylamino)-1-oxidanyl-ethyl]benzene-1,2-diol;hydrochloride EPINEPHRINE MLS001333244 cid_5924
TypeSmall organic molecule
Emp. Form.C9H13NO3
Mol. Mass.183.2044
SMILESCNCC(O)c1ccc(O)c(O)c1