Reaction Details
TargetAlpha-1A adrenergic receptor
LigandBDBM50027502
Substrate/Competitorn/a
Ki 2800±n/a nM
CommentsPDSP_20599
Citation U'Prichard, DCGreenberg, DASnyder, SH Binding characteristics of a radiolabeled agonist and antagonist at central nervous system alpha noradrenergic receptors. Mol Pharmacol13:454-73 (1977) Alpha-1A adrenergic receptor
Name:Alpha-1A adrenergic receptor
Type:Protein
Mol. Mass.:51620.15
Organism:Rattus norvegicus (Rat)
Description:P43140
Residue:466
BDBM50027502
NameBDBM50027502
Synonyms:4-(2-Amino-1-hydroxy-propyl)-benzene-1,2-diol Aldoclor-250 METHYLNORADRENALINE alpha-Methyl-(+/-)norepinephrine,(+/-) | alpha-Methyl-(-)norepinephrine,(+/-)
TypeSmall organic molecule
Emp. Form.C9H13NO3
Mol. Mass.183.2044
SMILESCC(N)C(O)c1ccc(O)c(O)c1