Reaction Details
TargetAlpha-1A adrenergic receptor
LigandBDBM22888
Substrate/Competitorn/a
Ki 1030±n/a nM
CommentsPDSP_20554
Citation U'Prichard, DCGreenberg, DASnyder, SH Binding characteristics of a radiolabeled agonist and antagonist at central nervous system alpha noradrenergic receptors. Mol Pharmacol13:454-73 (1977) Alpha-1A adrenergic receptor
Name:Alpha-1A adrenergic receptor
Type:Protein
Mol. Mass.:51620.15
Organism:Rattus norvegicus (Rat)
Description:P43140
Residue:466
BDBM22888
NameBDBM22888
Synonyms:1-[4-(1H-imidazol-5-yl)butyl]-3-methylthiourea CHEMBL12160
TypeSmall organic molecule
Emp. Form.C9H16N4S
Mol. Mass.212.315
SMILESCNC(=S)NCCCCc1cnc[nH]1