Reaction Details
TargetAlpha-1A adrenergic receptor
LigandBDBM32638
Substrate/Competitorn/a
Ki 10±n/a nM
CommentsPDSP_20653
Citation U'Prichard, DCGreenberg, DASnyder, SH Binding characteristics of a radiolabeled agonist and antagonist at central nervous system alpha noradrenergic receptors. Mol Pharmacol13:454-73 (1977) Alpha-1A adrenergic receptor
Name:Alpha-1A adrenergic receptor
Type:Protein
Mol. Mass.:51620.15
Organism:Rattus norvegicus (Rat)
Description:P43140
Residue:466
BDBM32638
NameBDBM32638
Synonyms:Dihydroergocristine | NSC409663
TypeAlkaloid
Emp. Form.C35H41N5O5
Mol. Mass.611.7305
SMILESCC(C)C1(NC(=O)C2CC3C(Cc4c[nH]c5cccc3c45)N(C)C2)OC2(O)C3CCCN3C(=O)C(Cc3ccccc3)N2C1=O