Reaction Details
TargetAlpha-1A adrenergic receptor
LigandBDBM50027065
Substrate/Competitorn/a
Ki 12±n/a nM
CommentsPDSP_20636
Citation U'Prichard, DCGreenberg, DASnyder, SH Binding characteristics of a radiolabeled agonist and antagonist at central nervous system alpha noradrenergic receptors. Mol Pharmacol13:454-73 (1977) Alpha-1A adrenergic receptor
Name:Alpha-1A adrenergic receptor
Type:Protein
Mol. Mass.:51620.15
Organism:Rattus norvegicus (Rat)
Description:P43140
Residue:466
BDBM50027065
NameBDBM50027065
Synonyms:(5'alpha)-12'-hydroxy-2'-methyl-5'-(phenylmethyl)ergotoman-3',6',18-trione 12'-hydroxy-2'-methyl-5'alpha-(phenylmethyl)ergotaman-3',6',18-trione Ergotamin
TypeSmall organic molecule
Emp. Form.C33H35N5O5
Mol. Mass.581.6615
SMILESCN1C[C@@H](C=C2[C@H]1Cc1c[nH]c3cccc2c13)C(=O)N[C@]1(C)O[C@@]2(O)[C@@H]3CCCN3C(=O)[C@H](Cc3ccccc3)N2C1=O