Reaction Details
TargetAlpha-1A adrenergic receptor
LigandBDBM79181
Substrate/Competitorn/a
Ki 44±n/a nM
CommentsPDSP_20565
Citation U'Prichard, DCGreenberg, DASnyder, SH Binding characteristics of a radiolabeled agonist and antagonist at central nervous system alpha noradrenergic receptors. Mol Pharmacol13:454-73 (1977) Alpha-1A adrenergic receptor
Name:Alpha-1A adrenergic receptor
Type:Protein
Mol. Mass.:51620.15
Organism:Rattus norvegicus (Rat)
Description:P43140
Residue:466
BDBM79181
NameBDBM79181
Synonyms:10-[3-(4-methyl-1-piperazinyl)propyl]-2-(trifluoromethyl)phenothiazine;hydrochloride 10-[3-(4-methylpiperazino)propyl]-2-(trifluoromethyl)phenothiazine;hydrochloride SMR000059133 TRIFLUOPERAZINE DIHYDROCHLORIDE US11542290, Compound Trifluoperazine cid_5566
TypeSmall organic molecule
Emp. Form.C21H24F3N3S
Mol. Mass.407.496
SMILESCN1CCN(CCCN2c3ccccc3Sc3ccc(cc23)C(F)(F)F)CC1