Reaction Details
TargetHistamine H1 receptor
LigandBDBM7966
Substrate/Competitorn/a
Ki>10000±n/a nM
CommentsPDSP_934
Citation Tran, VTChang, RSSnyder, SH Histamine H1 receptors identified in mammalian brain membranes with [3H]mepyramine. Proc Natl Acad Sci U S A75:6290-4 (1978) 
 
Histamine H1 receptor
Name:Histamine H1 receptor
Type:Enzyme Catalytic Domain
Mol. Mass.:55716.35
Organism:RAT
Description:HISTAMINE H1 HRH1 RAT::P31390
Residue:486
BDBM7966
NameBDBM7966
Synonyms:2-(1H-imidazol-4-yl)ethan-1-amine CHEMBL90 Ergotidine Histamine Peremin | [3H]histamine
TypeSmall organic molecule
Emp. Form.C5H9N3
Mol. Mass.111.1451
SMILESNCCc1cnc[nH]1