Reaction Details
TargetHistamine H1 receptor
LigandBDBM81467
Substrate/Competitorn/a
Ki 250±n/a nM
CommentsPDSP_1188
Citation Tran, VTChang, RSSnyder, SH Histamine H1 receptors identified in mammalian brain membranes with [3H]mepyramine. Proc Natl Acad Sci U S A75:6290-4 (1978) 
 
Histamine H1 receptor
Name:Histamine H1 receptor
Type:Enzyme Catalytic Domain
Mol. Mass.:55716.35
Organism:RAT
Description:HISTAMINE H1 HRH1 RAT::P31390
Residue:486
BDBM81467
NameBDBM81467
Synonyms:CAS_569-65-3 Meclizine US9182402, 13
TypeSmall organic molecule
Emp. Form.C25H27ClN2
Mol. Mass.390.948
SMILESCc1cccc(CN2CCN(CC2)C(c2ccccc2)c2ccc(Cl)cc2)c1