Reaction Details
TargetHistamine H1 receptor
LigandBDBM50292411
Substrate/Competitorn/a
Ki 5.6±n/a nM
CommentsPDSP_1917
Citation Tran, VTChang, RSSnyder, SH Histamine H1 receptors identified in mammalian brain membranes with [3H]mepyramine. Proc Natl Acad Sci U S A75:6290-4 (1978) 
 
Histamine H1 receptor
Name:Histamine H1 receptor
Type:Enzyme Catalytic Domain
Mol. Mass.:55716.35
Organism:RAT
Description:HISTAMINE H1 HRH1 RAT::P31390
Residue:486
BDBM50292411
NameBDBM50292411
Synonyms:(E)-2-(3-(pyrrolidin-1-yl)-1-p-tolylprop-1-enyl)pyridine 2-((E)-3-Pyrrolidin-1-yl-1-p-tolyl-propenyl)-pyridine 2-(3-Pyrrolidin-1-yl-1-p-tolyl-propenyl)-pyridine Actidil Allerfed Corphed Myfed TRIPROLIDINE Trilitron Triprolidin
TypeSmall organic molecule
Emp. Form.C19H22N2
Mol. Mass.278.3914
SMILESCc1ccc(cc1)C(=C/CN1CCCC1)\c1ccccn1