Reaction Details
TargetGamma-aminobutyric acid type B receptor subunit 1
LigandBDBM50281573
Substrate/Competitorn/a
Ki 30±n/a nM
CommentsPDSP_286
Citation Williams, MRisley, EA Characterization of the binding of [3H]muscimol, a potent gamma-aminobutyric acid agonist, to rat brain synaptosomal membranes using a filtration assay. J Neurochem32:713-8 (1979) 
 
Gamma-aminobutyric acid type B receptor subunit 1
Name:Gamma-aminobutyric acid type B receptor subunit 1
Type:Enzyme Catalytic Domain
Mol. Mass.:111548.69
Organism:Rattus norvegicus (Rat)
Description:Q9Z0U4
Residue:991
BDBM50281573
NameBDBM50281573
Synonyms:3-Amino-propane-1-sulfonic acid Aminopropanesulfonic-3 | CHEMBL149082
TypeSmall organic molecule
Emp. Form.C3H9NO3S
Mol. Mass.139.173
SMILESNCCCS(O)(=O)=O